{"text_format":"1","workbook":"xlsx","n_sheets":10,"sheets":["MTLWorksheet1","MTLWorksheet2","MTLWorksheet3","MTLWorksheet4","MTLWorksheet5","MTLWorksheet6","Instructions","Training Evals","Training Schedule","Instructions 2"],"not_rendered":{"charts":0,"images":0,"macros":1,"external_links":0,"defined_names":3,"comments":9,"pivot_tables":0},"unopened":[],"bounds":{"document_bytes":16777216,"sheet_cells":100000,"rows_first":2000,"rows_last":500,"rows_between":2000,"halvings":0,"cell_chars":16384,"cell_head_chars":4096},"cells_cut":0,"cells_raw":0,"read":"whole","date_system":"1900"}

{"sheet":"MTLWorksheet1","index":0,"n_rows":51,"n_cols":2,"rows_kept":51,"cut":false,"hidden":false,"merged":[]}
["Task Number","Task "]
[1]
[2]
[3]
[4]
[5]
[6]
[7]
[8]
[9]
{"$rows_left_out":42}
{"sheet":"MTLWorksheet2","index":1,"n_rows":51,"n_cols":6,"rows_kept":51,"cut":false,"hidden":false,"merged":[]}
["Task Number","Task ","Frequency","Complexity of Task","Complexity to Learn","Criticality"]
[1]
[2]
[3]
[4]
[5]
[6]
[7]
[8]
[9]
{"$rows_left_out":42}
{"sheet":"MTLWorksheet3","index":2,"n_rows":51,"n_cols":15,"rows_kept":51,"cut":false,"hidden":false,"merged":[]}
["Task Number","Task ","Frequency","Complexity of Task","Complexity to Learn","Criticality","Training Requirements","Knowledge Item?","Checklist?","Quality Check?","OJT?","Thorough Instructions?","Formal Training?","JITT","Job Aids"]
[1,{"$f":"IF(MTLWorksheet2!B2 = \"\",\"\",MTLWorksheet2!B2)","v":""},{"$f":"IF(MTLWorksheet2!C2 = \"\",\"\",MTLWorksheet2!C2)","v":""},{"$f":"IF(MTLWorksheet2!D2 = \"\",\"\",MTLWorksheet2!D2)","v":""},{"$f":"IF(MTLWorksheet2!E2 = \"\",\"\",MTLWorksheet2!E2)","v":""},{"$f":"IF(MTLWorksheet2!F2 = \"\",\"\",MTLWorksheet2!F2)","v":""},{"$f":"IF(D2=\"H\",\"Y\",(IF(E2=\"H\",\"Y\",(IF(D2=\"M\",(IF(E2=\"M\",\"Y\",\"N\")),\"N\")))))","v":"N"},{"$f":"IF(D2=\"H\",\"Y\",(IF(E2=\"H\",\"Y\",\"\")))","v":""},{"$f":"IF(F2=\"M\",\"Y\",(IF(F2=\"H\",\"Y\",\"\")))","v":""},{"$f":"IF(F2=\"H\",\"Y\",\"\")","v":""},{"$f":"IF(E2=\"L\",(IF(G2=\"Y\",\"Y\",\"\")),\"\")","v":""},{"$f":"IF(G2=\"Y\",(IF(C2=\"L\",\"Y\",\"\")),\"\")","v":""},{"$f":"IF(G2=\"Y\",(IF(E2=\"M\",\"Y\",(IF(E2=\"H\",\"Y\",\"\")))),\"\")","v":""},{"$f":"IF(G2=\"Y\",(IF(C2=\"L\",\"Y\",\"\")),\"\")","v":""},{"$f":"IF(C2=\"L\",(IF(OR(F2=\"M\",F2=\"H\"),\"Y\",\"\")),\"\")","v":""}]
[2,{"$f":"IF(MTLWorksheet2!B3 = \"\",\"\",MTLWorksheet2!B3)","v":""},{"$f":"IF(MTLWorksheet2!C3 = \"\",\"\",MTLWorksheet2!C3)","v":""},{"$f":"IF(MTLWorksheet2!D3 = \"\",\"\",MTLWorksheet2!D3)","v":""},{"$f":"IF(MTLWorksheet2!E3 = \"\",\"\",MTLWorksheet2!E3)","v":""},{"$f":"IF(MTLWorksheet2!F3 = \"\",\"\",MTLWorksheet2!F3)","v":""},"N",{"$f":"IF(D3=\"H\",\"Y\",(IF(E3=\"H\",\"Y\",\"\")))","v":""},{"$f":"IF(F3=\"M\",\"Y\",(IF(F3=\"H\",\"Y\",\"\")))","v":""},{"$f":"IF(F3=\"H\",\"Y\",\"\")","v":""},{"$f":"IF(E3=\"L\",(IF(G3=\"Y\",\"Y\",\"\")),\"\")","v":""},{"$f":"IF(G3=\"Y\",(IF(C3=\"L\",\"Y\",\"\")),\"\")","v":""},{"$f":"IF(G3=\"Y\",(IF(E3=\"M\",\"Y\",(IF(E3=\"H\",\"Y\",\"\")))),\"\")","v":""},{"$f":"IF(G3=\"Y\",(IF(C3=\"L\",\"Y\",\"\")),\"\")","v":""},{"$f":"IF(C3=\"L\",(IF(OR(F3=\"M\",F3=\"H\"),\"Y\",\"\")),\"\")","v":""}]
[3,{"$f":"IF(MTLWorksheet2!B4 = \"\",\"\",MTLWorksheet2!B4)","v":""},{"$f":"IF(MTLWorksheet2!C4 = \"\",\"\",MTLWorksheet2!C4)","v":""},{"$f":"IF(MTLWorksheet2!D4 = \"\",\"\",MTLWorksheet2!D4)","v":""},{"$f":"IF(MTLWorksheet2!E4 = \"\",\"\",MTLWorksheet2!E4)","v":""},{"$f":"IF(MTLWorksheet2!F4 = \"\",\"\",MTLWorksheet2!F4)","v":""},"N","","","","","","","",""]
[4,{"$f":"IF(MTLWorksheet2!B5 = \"\",\"\",MTLWorksheet2!B5)","v":""},{"$f":"IF(MTLWorksheet2!C5 = \"\",\"\",MTLWorksheet2!C5)","v":""},{"$f":"IF(MTLWorksheet2!D5 = \"\",\"\",MTLWorksheet2!D5)","v":""},{"$f":"IF(MTLWorksheet2!E5 = \"\",\"\",MTLWorksheet2!E5)","v":""},{"$f":"IF(MTLWorksheet2!F5 = \"\",\"\",MTLWorksheet2!F5)","v":""},"N","","","","","","","",""]
[5,{"$f":"IF(MTLWorksheet2!B6 = \"\",\"\",MTLWorksheet2!B6)","v":""},{"$f":"IF(MTLWorksheet2!C6 = \"\",\"\",MTLWorksheet2!C6)","v":""},{"$f":"IF(MTLWorksheet2!D6 = \"\",\"\",MTLWorksheet2!D6)","v":""},{"$f":"IF(MTLWorksheet2!E6 = \"\",\"\",MTLWorksheet2!E6)","v":""},{"$f":"IF(MTLWorksheet2!F6 = \"\",\"\",MTLWorksheet2!F6)","v":""},"N","","","","","","","",""]
[6,{"$f":"IF(MTLWorksheet2!B7 = \"\",\"\",MTLWorksheet2!B7)","v":""},{"$f":"IF(MTLWorksheet2!C7 = \"\",\"\",MTLWorksheet2!C7)","v":""},{"$f":"IF(MTLWorksheet2!D7 = \"\",\"\",MTLWorksheet2!D7)","v":""},{"$f":"IF(MTLWorksheet2!E7 = \"\",\"\",MTLWorksheet2!E7)","v":""},{"$f":"IF(MTLWorksheet2!F7 = \"\",\"\",MTLWorksheet2!F7)","v":""},"N","","","","","","","",""]
[7,{"$f":"IF(MTLWorksheet2!B8 = \"\",\"\",MTLWorksheet2!B8)","v":""},{"$f":"IF(MTLWorksheet2!C8 = \"\",\"\",MTLWorksheet2!C8)","v":""},{"$f":"IF(MTLWorksheet2!D8 = \"\",\"\",MTLWorksheet2!D8)","v":""},{"$f":"IF(MTLWorksheet2!E8 = \"\",\"\",MTLWorksheet2!E8)","v":""},{"$f":"IF(MTLWorksheet2!F8 = \"\",\"\",MTLWorksheet2!F8)","v":""},"N","","","","","","","",""]
[8,{"$f":"IF(MTLWorksheet2!B9 = \"\",\"\",MTLWorksheet2!B9)","v":""},{"$f":"IF(MTLWorksheet2!C9 = \"\",\"\",MTLWorksheet2!C9)","v":""},{"$f":"IF(MTLWorksheet2!D9 = \"\",\"\",MTLWorksheet2!D9)","v":""},{"$f":"IF(MTLWorksheet2!E9 = \"\",\"\",MTLWorksheet2!E9)","v":""},{"$f":"IF(MTLWorksheet2!F9 = \"\",\"\",MTLWorksheet2!F9)","v":""},"N","","","","","","","",""]
[9,{"$f":"IF(MTLWorksheet2!B10 = \"\",\"\",MTLWorksheet2!B10)","v":""},{"$f":"IF(MTLWorksheet2!C10 = \"\",\"\",MTLWorksheet2!C10)","v":""},{"$f":"IF(MTLWorksheet2!D10 = \"\",\"\",MTLWorksheet2!D10)","v":""},{"$f":"IF(MTLWorksheet2!E10 = \"\",\"\",MTLWorksheet2!E10)","v":""},{"$f":"IF(MTLWorksheet2!F10 = \"\",\"\",MTLWorksheet2!F10)","v":""},"N","","","","","","","",""]
{"$rows_left_out":42}
{"sheet":"MTLWorksheet4","index":3,"n_rows":51,"n_cols":10,"rows_kept":51,"cut":false,"hidden":false,"merged":[]}
["Task Number","Task ","Frequency","Complexity of Task","Complexity to Learn","Criticality","Training Requirements","Required Skill\n(worker)","Required Skill\n(supervisor)","Final Score*"]
[1,null,null,null,null,null,null,null,null,{"$f":"IF(H2=\"\",\"\",IF(H2<I2, I2,H2))","v":""}]
[2,null,null,null,null,null,null,null,null,{"$f":"IF(H3=\"\",\"\",IF(H3<I3, I3,H3))","v":""}]
[3,null,null,null,null,null,null,null,null,""]
[4,null,null,null,null,null,null,null,null,""]
[5,null,null,null,null,null,null,null,null,""]
[6,null,null,null,null,null,null,null,null,""]
[7,null,null,null,null,null,null,null,null,""]
[8,null,null,null,null,null,null,null,null,""]
[9,null,null,null,null,null,null,null,null,""]
{"$rows_left_out":42}
{"sheet":"MTLWorksheet5","index":4,"n_rows":51,"n_cols":11,"rows_kept":51,"cut":false,"hidden":false,"merged":[]}
["Task Number","Task ","Frequency","Complexity of Task","Complexity to Learn","Criticality","Training Requirements","Required Skill\n(Agreed)","Current Skill\n(worker)","Current Skill\n(Supervisor)","Final Score*"]
[1,{"$f":"IF(MTLWorksheet4!B2 = \"\",\"\",MTLWorksheet4!B2)","v":""},{"$f":"IF(MTLWorksheet4!C2 = \"\",\"\",MTLWorksheet4!C2)","v":""},{"$f":"IF(MTLWorksheet4!D2 = \"\",\"\",MTLWorksheet4!D2)","v":""},{"$f":"IF(MTLWorksheet4!E2 = \"\",\"\",MTLWorksheet4!E2)","v":""},{"$f":"IF(MTLWorksheet4!F2 = \"\",\"\",MTLWorksheet4!F2)","v":""},{"$f":"IF(MTLWorksheet4!G2 = \"\",\"\",MTLWorksheet4!G2)","v":""},{"$f":"IF(MTLWorksheet4!J2 = \"\",\"\",MTLWorksheet4!J2)","v":""},null,null,{"$f":"IF(I2=\"\",\"\",IF(I2>J2, J2,I2))","v":""}]
[2,{"$f":"IF(MTLWorksheet4!B3 = \"\",\"\",MTLWorksheet4!B3)","v":""},{"$f":"IF(MTLWorksheet4!C3 = \"\",\"\",MTLWorksheet4!C3)","v":""},{"$f":"IF(MTLWorksheet4!D3 = \"\",\"\",MTLWorksheet4!D3)","v":""},{"$f":"IF(MTLWorksheet4!E3 = \"\",\"\",MTLWorksheet4!E3)","v":""},{"$f":"IF(MTLWorksheet4!F3 = \"\",\"\",MTLWorksheet4!F3)","v":""},{"$f":"IF(MTLWorksheet4!G3 = \"\",\"\",MTLWorksheet4!G3)","v":""},{"$f":"IF(MTLWorksheet4!J3 = \"\",\"\",MTLWorksheet4!J3)","v":""},null,null,{"$f":"IF(I3=\"\",\"\",IF(I3>J3, J3,I3))","v":""}]
[3,{"$f":"IF(MTLWorksheet4!B4 = \"\",\"\",MTLWorksheet4!B4)","v":""},{"$f":"IF(MTLWorksheet4!C4 = \"\",\"\",MTLWorksheet4!C4)","v":""},{"$f":"IF(MTLWorksheet4!D4 = \"\",\"\",MTLWorksheet4!D4)","v":""},{"$f":"IF(MTLWorksheet4!E4 = \"\",\"\",MTLWorksheet4!E4)","v":""},{"$f":"IF(MTLWorksheet4!F4 = \"\",\"\",MTLWorksheet4!F4)","v":""},{"$f":"IF(MTLWorksheet4!G4 = \"\",\"\",MTLWorksheet4!G4)","v":""},{"$f":"IF(MTLWorksheet4!J4 = \"\",\"\",MTLWorksheet4!J4)","v":""},null,null,""]
[4,{"$f":"IF(MTLWorksheet4!B5 = \"\",\"\",MTLWorksheet4!B5)","v":""},{"$f":"IF(MTLWorksheet4!C5 = \"\",\"\",MTLWorksheet4!C5)","v":""},{"$f":"IF(MTLWorksheet4!D5 = \"\",\"\",MTLWorksheet4!D5)","v":""},{"$f":"IF(MTLWorksheet4!E5 = \"\",\"\",MTLWorksheet4!E5)","v":""},{"$f":"IF(MTLWorksheet4!F5 = \"\",\"\",MTLWorksheet4!F5)","v":""},{"$f":"IF(MTLWorksheet4!G5 = \"\",\"\",MTLWorksheet4!G5)","v":""},{"$f":"IF(MTLWorksheet4!J5 = \"\",\"\",MTLWorksheet4!J5)","v":""},null,null,""]
[5,{"$f":"IF(MTLWorksheet4!B6 = \"\",\"\",MTLWorksheet4!B6)","v":""},{"$f":"IF(MTLWorksheet4!C6 = \"\",\"\",MTLWorksheet4!C6)","v":""},{"$f":"IF(MTLWorksheet4!D6 = \"\",\"\",MTLWorksheet4!D6)","v":""},{"$f":"IF(MTLWorksheet4!E6 = \"\",\"\",MTLWorksheet4!E6)","v":""},{"$f":"IF(MTLWorksheet4!F6 = \"\",\"\",MTLWorksheet4!F6)","v":""},{"$f":"IF(MTLWorksheet4!G6 = \"\",\"\",MTLWorksheet4!G6)","v":""},{"$f":"IF(MTLWorksheet4!J6 = \"\",\"\",MTLWorksheet4!J6)","v":""},null,null,""]
[6,{"$f":"IF(MTLWorksheet4!B7 = \"\",\"\",MTLWorksheet4!B7)","v":""},{"$f":"IF(MTLWorksheet4!C7 = \"\",\"\",MTLWorksheet4!C7)","v":""},{"$f":"IF(MTLWorksheet4!D7 = \"\",\"\",MTLWorksheet4!D7)","v":""},{"$f":"IF(MTLWorksheet4!E7 = \"\",\"\",MTLWorksheet4!E7)","v":""},{"$f":"IF(MTLWorksheet4!F7 = \"\",\"\",MTLWorksheet4!F7)","v":""},{"$f":"IF(MTLWorksheet4!G7 = \"\",\"\",MTLWorksheet4!G7)","v":""},{"$f":"IF(MTLWorksheet4!J7 = \"\",\"\",MTLWorksheet4!J7)","v":""},null,null,""]
[7,{"$f":"IF(MTLWorksheet4!B8 = \"\",\"\",MTLWorksheet4!B8)","v":""},{"$f":"IF(MTLWorksheet4!C8 = \"\",\"\",MTLWorksheet4!C8)","v":""},{"$f":"IF(MTLWorksheet4!D8 = \"\",\"\",MTLWorksheet4!D8)","v":""},{"$f":"IF(MTLWorksheet4!E8 = \"\",\"\",MTLWorksheet4!E8)","v":""},{"$f":"IF(MTLWorksheet4!F8 = \"\",\"\",MTLWorksheet4!F8)","v":""},{"$f":"IF(MTLWorksheet4!G8 = \"\",\"\",MTLWorksheet4!G8)","v":""},{"$f":"IF(MTLWorksheet4!J8 = \"\",\"\",MTLWorksheet4!J8)","v":""},null,null,""]
[8,{"$f":"IF(MTLWorksheet4!B9 = \"\",\"\",MTLWorksheet4!B9)","v":""},{"$f":"IF(MTLWorksheet4!C9 = \"\",\"\",MTLWorksheet4!C9)","v":""},{"$f":"IF(MTLWorksheet4!D9 = \"\",\"\",MTLWorksheet4!D9)","v":""},{"$f":"IF(MTLWorksheet4!E9 = \"\",\"\",MTLWorksheet4!E9)","v":""},{"$f":"IF(MTLWorksheet4!F9 = \"\",\"\",MTLWorksheet4!F9)","v":""},{"$f":"IF(MTLWorksheet4!G9 = \"\",\"\",MTLWorksheet4!G9)","v":""},{"$f":"IF(MTLWorksheet4!J9 = \"\",\"\",MTLWorksheet4!J9)","v":""},null,null,""]
[9,{"$f":"IF(MTLWorksheet4!B10 = \"\",\"\",MTLWorksheet4!B10)","v":""},{"$f":"IF(MTLWorksheet4!C10 = \"\",\"\",MTLWorksheet4!C10)","v":""},{"$f":"IF(MTLWorksheet4!D10 = \"\",\"\",MTLWorksheet4!D10)","v":""},{"$f":"IF(MTLWorksheet4!E10 = \"\",\"\",MTLWorksheet4!E10)","v":""},{"$f":"IF(MTLWorksheet4!F10 = \"\",\"\",MTLWorksheet4!F10)","v":""},{"$f":"IF(MTLWorksheet4!G10 = \"\",\"\",MTLWorksheet4!G10)","v":""},{"$f":"IF(MTLWorksheet4!J10 = \"\",\"\",MTLWorksheet4!J10)","v":""},null,null,""]
{"$rows_left_out":42}
{"sheet":"MTLWorksheet6","index":5,"n_rows":51,"n_cols":10,"rows_kept":51,"cut":false,"hidden":false,"merged":[]}
["Task Number","Task ","Frequency","Complexity of Task","Complexity to Learn","Criticality","Training Requirements","Required Skill\n(Agreed)","Current Skill\n(Agreed)","% Trained"]
[1,{"$f":"IF(MTLWorksheet5!B2 = \"\",\"\",MTLWorksheet5!B2)","v":""},{"$f":"IF(MTLWorksheet5!C2 = \"\",\"\",MTLWorksheet5!C2)","v":""},{"$f":"IF(MTLWorksheet5!D2 = \"\",\"\",MTLWorksheet5!D2)","v":""},{"$f":"IF(MTLWorksheet5!E2 = \"\",\"\",MTLWorksheet5!E2)","v":""},{"$f":"IF(MTLWorksheet5!F2 = \"\",\"\",MTLWorksheet5!F2)","v":""},{"$f":"IF(MTLWorksheet5!G2 = \"\",\"\",MTLWorksheet5!G2)","v":""},{"$f":"IF(MTLWorksheet5!H2 = \"\",\"\",MTLWorksheet5!H2)","v":""},{"$f":"IF(MTLWorksheet5!K2 = \"\",\"\",MTLWorksheet5!K2)","v":""},{"$f":"IF(H2=\"\",\"\",IF((100%/H2*I2)>100%,100%,(100%/H2*I2)))","v":""}]
[2,{"$f":"IF(MTLWorksheet5!B3 = \"\",\"\",MTLWorksheet5!B3)","v":""},{"$f":"IF(MTLWorksheet5!C3 = \"\",\"\",MTLWorksheet5!C3)","v":""},{"$f":"IF(MTLWorksheet5!D3 = \"\",\"\",MTLWorksheet5!D3)","v":""},{"$f":"IF(MTLWorksheet5!E3 = \"\",\"\",MTLWorksheet5!E3)","v":""},{"$f":"IF(MTLWorksheet5!F3 = \"\",\"\",MTLWorksheet5!F3)","v":""},{"$f":"IF(MTLWorksheet5!G3 = \"\",\"\",MTLWorksheet5!G3)","v":""},{"$f":"IF(MTLWorksheet5!H3 = \"\",\"\",MTLWorksheet5!H3)","v":""},{"$f":"IF(MTLWorksheet5!K3 = \"\",\"\",MTLWorksheet5!K3)","v":""},{"$f":"IF(H3=\"\",\"\",IF((100%/H3*I3)>100%,100%,(100%/H3*I3)))","v":""}]
[3,{"$f":"IF(MTLWorksheet5!B4 = \"\",\"\",MTLWorksheet5!B4)","v":""},{"$f":"IF(MTLWorksheet5!C4 = \"\",\"\",MTLWorksheet5!C4)","v":""},{"$f":"IF(MTLWorksheet5!D4 = \"\",\"\",MTLWorksheet5!D4)","v":""},{"$f":"IF(MTLWorksheet5!E4 = \"\",\"\",MTLWorksheet5!E4)","v":""},{"$f":"IF(MTLWorksheet5!F4 = \"\",\"\",MTLWorksheet5!F4)","v":""},{"$f":"IF(MTLWorksheet5!G4 = \"\",\"\",MTLWorksheet5!G4)","v":""},{"$f":"IF(MTLWorksheet5!H4 = \"\",\"\",MTLWorksheet5!H4)","v":""},{"$f":"IF(MTLWorksheet5!K4 = \"\",\"\",MTLWorksheet5!K4)","v":""},""]
[4,{"$f":"IF(MTLWorksheet5!B5 = \"\",\"\",MTLWorksheet5!B5)","v":""},{"$f":"IF(MTLWorksheet5!C5 = \"\",\"\",MTLWorksheet5!C5)","v":""},{"$f":"IF(MTLWorksheet5!D5 = \"\",\"\",MTLWorksheet5!D5)","v":""},{"$f":"IF(MTLWorksheet5!E5 = \"\",\"\",MTLWorksheet5!E5)","v":""},{"$f":"IF(MTLWorksheet5!F5 = \"\",\"\",MTLWorksheet5!F5)","v":""},{"$f":"IF(MTLWorksheet5!G5 = \"\",\"\",MTLWorksheet5!G5)","v":""},{"$f":"IF(MTLWorksheet5!H5 = \"\",\"\",MTLWorksheet5!H5)","v":""},{"$f":"IF(MTLWorksheet5!K5 = \"\",\"\",MTLWorksheet5!K5)","v":""},""]
[5,{"$f":"IF(MTLWorksheet5!B6 = \"\",\"\",MTLWorksheet5!B6)","v":""},{"$f":"IF(MTLWorksheet5!C6 = \"\",\"\",MTLWorksheet5!C6)","v":""},{"$f":"IF(MTLWorksheet5!D6 = \"\",\"\",MTLWorksheet5!D6)","v":""},{"$f":"IF(MTLWorksheet5!E6 = \"\",\"\",MTLWorksheet5!E6)","v":""},{"$f":"IF(MTLWorksheet5!F6 = \"\",\"\",MTLWorksheet5!F6)","v":""},{"$f":"IF(MTLWorksheet5!G6 = \"\",\"\",MTLWorksheet5!G6)","v":""},{"$f":"IF(MTLWorksheet5!H6 = \"\",\"\",MTLWorksheet5!H6)","v":""},{"$f":"IF(MTLWorksheet5!K6 = \"\",\"\",MTLWorksheet5!K6)","v":""},""]
[6,{"$f":"IF(MTLWorksheet5!B7 = \"\",\"\",MTLWorksheet5!B7)","v":""},{"$f":"IF(MTLWorksheet5!C7 = \"\",\"\",MTLWorksheet5!C7)","v":""},{"$f":"IF(MTLWorksheet5!D7 = \"\",\"\",MTLWorksheet5!D7)","v":""},{"$f":"IF(MTLWorksheet5!E7 = \"\",\"\",MTLWorksheet5!E7)","v":""},{"$f":"IF(MTLWorksheet5!F7 = \"\",\"\",MTLWorksheet5!F7)","v":""},{"$f":"IF(MTLWorksheet5!G7 = \"\",\"\",MTLWorksheet5!G7)","v":""},{"$f":"IF(MTLWorksheet5!H7 = \"\",\"\",MTLWorksheet5!H7)","v":""},{"$f":"IF(MTLWorksheet5!K7 = \"\",\"\",MTLWorksheet5!K7)","v":""},""]
[7,{"$f":"IF(MTLWorksheet5!B8 = \"\",\"\",MTLWorksheet5!B8)","v":""},{"$f":"IF(MTLWorksheet5!C8 = \"\",\"\",MTLWorksheet5!C8)","v":""},{"$f":"IF(MTLWorksheet5!D8 = \"\",\"\",MTLWorksheet5!D8)","v":""},{"$f":"IF(MTLWorksheet5!E8 = \"\",\"\",MTLWorksheet5!E8)","v":""},{"$f":"IF(MTLWorksheet5!F8 = \"\",\"\",MTLWorksheet5!F8)","v":""},{"$f":"IF(MTLWorksheet5!G8 = \"\",\"\",MTLWorksheet5!G8)","v":""},{"$f":"IF(MTLWorksheet5!H8 = \"\",\"\",MTLWorksheet5!H8)","v":""},{"$f":"IF(MTLWorksheet5!K8 = \"\",\"\",MTLWorksheet5!K8)","v":""},""]
[8,{"$f":"IF(MTLWorksheet5!B9 = \"\",\"\",MTLWorksheet5!B9)","v":""},{"$f":"IF(MTLWorksheet5!C9 = \"\",\"\",MTLWorksheet5!C9)","v":""},{"$f":"IF(MTLWorksheet5!D9 = \"\",\"\",MTLWorksheet5!D9)","v":""},{"$f":"IF(MTLWorksheet5!E9 = \"\",\"\",MTLWorksheet5!E9)","v":""},{"$f":"IF(MTLWorksheet5!F9 = \"\",\"\",MTLWorksheet5!F9)","v":""},{"$f":"IF(MTLWorksheet5!G9 = \"\",\"\",MTLWorksheet5!G9)","v":""},{"$f":"IF(MTLWorksheet5!H9 = \"\",\"\",MTLWorksheet5!H9)","v":""},{"$f":"IF(MTLWorksheet5!K9 = \"\",\"\",MTLWorksheet5!K9)","v":""},""]
[9,{"$f":"IF(MTLWorksheet5!B10 = \"\",\"\",MTLWorksheet5!B10)","v":""},{"$f":"IF(MTLWorksheet5!C10 = \"\",\"\",MTLWorksheet5!C10)","v":""},{"$f":"IF(MTLWorksheet5!D10 = \"\",\"\",MTLWorksheet5!D10)","v":""},{"$f":"IF(MTLWorksheet5!E10 = \"\",\"\",MTLWorksheet5!E10)","v":""},{"$f":"IF(MTLWorksheet5!F10 = \"\",\"\",MTLWorksheet5!F10)","v":""},{"$f":"IF(MTLWorksheet5!G10 = \"\",\"\",MTLWorksheet5!G10)","v":""},{"$f":"IF(MTLWorksheet5!H10 = \"\",\"\",MTLWorksheet5!H10)","v":""},{"$f":"IF(MTLWorksheet5!K10 = \"\",\"\",MTLWorksheet5!K10)","v":""},""]
{"$rows_left_out":42}
{"sheet":"Instructions","index":6,"n_rows":11,"n_cols":7,"rows_kept":11,"cut":false,"hidden":false,"merged":[]}
[null,"Task ","Frequency","Complexity of Task","Complexity to Learn","Criticality","Training Reqt's"]
[1]
[2]
[3]
[4]
[5]
[6]
[7]
[8]
[9]
{"$rows_left_out":2}
{"sheet":"Training Evals","index":7,"n_rows":27,"n_cols":13,"rows_kept":27,"cut":false,"hidden":false,"merged":[[0,1,0,2],[0,7,0,10]]}
[null,"Skill Level",null,null,null,null,null,"Training Schedule",null,null,null,null,"% trained"]
["Task","Req't","Now","GAP",null,"Priority",null,"Proj start date","Actual St Date","Proj end date","Actual End date",null,{"$f":"AVERAGE(M4:M25)","v":{"$error":"#DIV/0!"}}]
["Area 1"]
[null,null,null,{"$f":"IF(C4-B4=0,\"\",C4-B4)","v":""},null,null,null,null,null,null,null,null,{"$f":"IF((100%/B4*C4)>100%,100%,(100%/B4*C4))","v":{"$error":"#DIV/0!"}}]
[null,null,null,"",null,null,null,null,null,null,null,null,{"$error":"#DIV/0!"}]
[null,null,null,"",null,null,null,null,null,null,null,null,{"$error":"#DIV/0!"}]
[null,null,null,"",null,null,null,null,null,null,null,null,{"$error":"#DIV/0!"}]
[null,null,null,"",null,null,null,null,null,null,null,null,{"$error":"#DIV/0!"}]
[null,null,null,"",null,null,null,null,null,null,null,null,{"$error":"#DIV/0!"}]
[null,null,null,"",null,null,null,null,null,null,null,null,{"$error":"#DIV/0!"}]
{"$rows_left_out":18}
{"sheet":"Training Schedule","index":8,"n_rows":25,"n_cols":11,"rows_kept":25,"cut":false,"hidden":false,"merged":[[0,3,1,3],[0,9,1,9],[0,10,1,10],[0,8,1,8],[0,5,1,5],[0,6,1,6]]}
[null,"Skill level  ",null,"knowledge?","Training Schedule","Date Schedule","Date Complete",null,"Skill lvl after","% Trained","Priority"]
["Task","initial skill lvl ",null,null,"Title",null,null,"Source"]
["Area 1"]
[null,null,null,null,null,null,null,null,null,{"$f":"VLOOKUP(A4,'Training Evals'!A4:M50,13,FALSE)","v":{"$error":"#N/A"}},{"$f":"VLOOKUP(A4,'Training Evals'!A4:N51,6,FALSE)","v":{"$error":"#N/A"}}]
[null,null,null,null,null,null,null,null,null,{"$f":"VLOOKUP(A5,'Training Evals'!A5:M51,13,FALSE)","v":{"$error":"#N/A"}},{"$f":"VLOOKUP(A5,'Training Evals'!A5:N52,6,FALSE)","v":{"$error":"#N/A"}}]
[null,null,null,null,null,null,null,null,null,{"$f":"VLOOKUP(A6,'Training Evals'!A6:M52,13,FALSE)","v":{"$error":"#N/A"}},{"$f":"VLOOKUP(A6,'Training Evals'!A6:N53,6,FALSE)","v":{"$error":"#N/A"}}]
[null,null,null,null,null,null,null,null,null,{"$f":"VLOOKUP(A7,'Training Evals'!A7:M53,13,FALSE)","v":{"$error":"#N/A"}},{"$f":"VLOOKUP(A7,'Training Evals'!A7:N54,6,FALSE)","v":{"$error":"#N/A"}}]
[null,null,null,null,null,null,null,null,null,{"$f":"VLOOKUP(A8,'Training Evals'!A8:M54,13,FALSE)","v":{"$error":"#N/A"}},{"$f":"VLOOKUP(A8,'Training Evals'!A8:N55,6,FALSE)","v":{"$error":"#N/A"}}]
[null,null,null,null,null,null,null,null,null,{"$f":"VLOOKUP(A9,'Training Evals'!A9:M55,13,FALSE)","v":{"$error":"#N/A"}},{"$f":"VLOOKUP(A9,'Training Evals'!A9:N56,6,FALSE)","v":{"$error":"#N/A"}}]
[null,null,null,null,null,null,null,null,null,{"$f":"VLOOKUP(A10,'Training Evals'!A10:M56,13,FALSE)","v":{"$error":"#N/A"}},{"$f":"VLOOKUP(A10,'Training Evals'!A10:N57,6,FALSE)","v":{"$error":"#N/A"}}]
{"$rows_left_out":16}
{"sheet":"Instructions 2","index":9,"n_rows":51,"n_cols":3,"rows_kept":51,"cut":false,"hidden":false,"merged":[]}
["STEPS"]
[1,"Assign requirement values (Req't)"]
[2,"Assess current level (NOW)"]
[3,"Conduct gap assessment [ gap value = degree of development needed] "]
[4,"Develop ACTION PLAN FOR PROFESSIONAL DEVELOPMENT"]
[5,"Schedule training"]
[6,"Execute & track results of plan"]
[7,"Repeat at appropriate intervals"]
[]
["RATINGS"]
{"$rows_left_out":41}